दिलचस्प पोस्ट
कस्टम सीमांकक के साथ फाइल नामों की एक से अधिक पंक्तियां कैसे जुड़ें? तालिका में लापता मूल्यों सहित () परिणामों में आर उन वस्तुओं के क्रम के बावजूद समानता के लिए दो संग्रह की तुलना करना PrimeFaces पी का उपयोग कैसे करें: fileUpload? श्रोता विधि कभी लागू नहीं होती है या अपलोड की गई फ़ाइल शून्य / फेंकता है त्रुटि / उपयोगी नहीं है क्या इस समय जटिलता वास्तव में हे (एन ^ 2) है? N + 1 का चयन करें प्रश्न समस्या क्या है? प्रविष्टि के क्रम में नक्शे को पुनरावृति क्यों नहीं किया जा सकता? फ़ायरफ़ॉक्स समान मूल नीति को अक्षम करें अजगर 3.x में string.replace () का उपयोग कैसे करें आप कैसे यूनिट परीक्षण निजी विधियों कर सकते हैं? मैं वेबपेज में जावास्क्रिप्ट कोड कैसे छिपा सकता हूं? Google Plus लॉगिन के एकीकरण के साथ "एक आंतरिक त्रुटि हुई" Mysql में group_concat के समान ओरेकल में कोई फ़ंक्शन है? Google मानचित्र V2 पर मार्करों को एनिमेट करना Https.request के साथ node.js में अमान्य स्वयं-हस्ताक्षरित एसएसएल प्रमाणपत्र पर ध्यान न दें?

कॉन्फ़िगर करें: त्रुटि: सी कंपाइलर निष्पादनयोग्य नहीं बना सकता

मैंने स्टैक ओवरफ्लो पर ऐसे कई प्रश्नों की जांच की है, लेकिन अभी तक कोई जवाब नहीं मिला है।

मैं शेर ओएसएक्स पर मेम्कैच को स्थापित करने की कोशिश कर रहा हूं जैसा कि यहां दिखाया गया है ।

यहां मैं क्या कर रहा हूं:

j-court-demones-macbook-pro:libevent-1.4.12-stable jcourtdemone$ ./configure; make checking for a BSD-compatible install... /usr/bin/install -c checking whether build environment is sane... yes checking for a thread-safe mkdir -p... ./install-sh -c -d checking for gawk... no checking for mawk... no checking for nawk... no checking for awk... awk checking whether make sets $(MAKE)... yes checking for gcc... gcc checking for C compiler default output file name... configure: error: in `/tmp/libevent-1.4.12-stable': configure: error: C compiler cannot create executables See `config.log' for more details. make: *** No targets specified and no makefile found. Stop. 

मैंने कुछ ही जगहों पर एक्सकोड की सिफारिश की थी, लेकिन कोई पासा नहीं था।

यहाँ मेरी config.log है:

 This file contains any messages produced by compilers while running configure, to aid debugging if configure makes a mistake. It was created by configure, which was generated by GNU Autoconf 2.63. Invocation command line was $ ./configure ## --------- ## ## Platform. ## ## --------- ## hostname = j-court-demones-macbook-pro.local uname -m = x86_64 uname -r = 11.3.0 uname -s = Darwin uname -v = Darwin Kernel Version 11.3.0: Thu Jan 12 18:47:41 PST 2012; root:xnu-1699.24.23~1/RELEASE_X86_64 /usr/bin/uname -p = i386 /bin/uname -X = unknown /bin/arch = unknown /usr/bin/arch -k = unknown /usr/convex/getsysinfo = unknown /usr/bin/hostinfo = Mach kernel version: Darwin Kernel Version 11.3.0: Thu Jan 12 18:47:41 PST 2012; root:xnu-1699.24.23~1/RELEASE_X86_64 Kernel configured for up to 8 processors. 4 processors are physically available. 8 processors are logically available. Processor type: i486 (Intel 80486) Processors active: 0 1 2 3 4 5 6 7 Primary memory available: 4.00 gigabytes Default processor set: 109 tasks, 599 threads, 8 processors Load average: 0.98, Mach factor: 7.01 /bin/machine = unknown /usr/bin/oslevel = unknown /bin/universe = unknown PATH: /opt/local/bin PATH: /opt/local/sbin PATH: /opt/local/bin PATH: /opt/local/sbin PATH: /usr/bin PATH: /Developer/usr/bin PATH: /usr/bin PATH: /bin PATH: /usr/sbin PATH: /sbin PATH: /usr/local/bin PATH: /usr/X11/bin ## ----------- ## ## Core tests. ## ## ----------- ## configure:2077: checking for a BSD-compatible install configure:2145: result: /usr/bin/install -c configure:2156: checking whether build environment is sane configure:2199: result: yes configure:2224: checking for a thread-safe mkdir -p configure:2263: result: ./install-sh -c -d configure:2276: checking for gawk configure:2306: result: no configure:2276: checking for mawk configure:2306: result: no configure:2276: checking for nawk configure:2306: result: no configure:2276: checking for awk configure:2292: found /usr/bin/awk configure:2303: result: awk configure:2314: checking whether make sets $(MAKE) configure:2336: result: yes configure:2575: checking for gcc configure:2591: found /Developer/usr/bin/gcc configure:2602: result: gcc configure:2834: checking for C compiler version configure:2842: gcc --version >&5 i686-apple-darwin9-gcc-4.0.1 (GCC) 4.0.1 (Apple Inc. build 5484) Copyright (C) 2005 Free Software Foundation, Inc. This is free software; see the source for copying conditions. There is NO warranty; not even for MERCHANTABILITY or FITNESS FOR A PARTICULAR PURPOSE. configure:2846: $? = 0 configure:2853: gcc -v >&5 Using built-in specs. Target: i686-apple-darwin9 Configured with: /var/tmp/gcc/gcc-5484~1/src/configure --disable-checking -enable-werror --prefix=/usr --mandir=/share/man --enable-languages=c,objc,c++,obj-c++ --program-transform-name=/^[cg][^.-]*$/s/$/-4.0/ --with-gxx-include-dir=/include/c++/4.0.0 --with-slibdir=/usr/lib --build=i686-apple-darwin9 --with-arch=apple --with-tune=generic --host=i686-apple-darwin9 --target=i686-apple-darwin9 Thread model: posix gcc version 4.0.1 (Apple Inc. build 5484) configure:2857: $? = 0 configure:2864: gcc -V >&5 gcc-4.0: argument to `-V' is missing configure:2868: $? = 1 configure:2891: checking for C compiler default output file name configure:2913: gcc conftest.c >&5 ld: library not found for -lcrt1.10.5.o collect2: ld returned 1 exit status configure:2917: $? = 1 configure:2955: result: configure: failed program was: | /* confdefs.h. */ | #define PACKAGE_NAME "" | #define PACKAGE_TARNAME "" | #define PACKAGE_VERSION "" | #define PACKAGE_STRING "" | #define PACKAGE_BUGREPORT "" | #define PACKAGE "libevent" | #define VERSION "1.4.12-stable" | /* end confdefs.h. */ | | int | main () | { | | ; | return 0; | } configure:2961: error: in `/tmp/libevent-1.4.12-stable': configure:2964: error: C compiler cannot create executables See `config.log' for more details. ## ---------------- ## ## Cache variables. ## ## ---------------- ## ac_cv_env_CCC_set= ac_cv_env_CCC_value= ac_cv_env_CC_set= ac_cv_env_CC_value= ac_cv_env_CFLAGS_set= ac_cv_env_CFLAGS_value= ac_cv_env_CPPFLAGS_set= ac_cv_env_CPPFLAGS_value= ac_cv_env_CPP_set= ac_cv_env_CPP_value= ac_cv_env_CXXCPP_set= ac_cv_env_CXXCPP_value= ac_cv_env_CXXFLAGS_set= ac_cv_env_CXXFLAGS_value= ac_cv_env_CXX_set= ac_cv_env_CXX_value= ac_cv_env_F77_set= ac_cv_env_F77_value= ac_cv_env_FFLAGS_set= ac_cv_env_FFLAGS_value= ac_cv_env_LDFLAGS_set= ac_cv_env_LDFLAGS_value= ac_cv_env_LIBS_set= ac_cv_env_LIBS_value= ac_cv_env_build_alias_set= ac_cv_env_build_alias_value= ac_cv_env_host_alias_set= ac_cv_env_host_alias_value= ac_cv_env_target_alias_set= ac_cv_env_target_alias_value= ac_cv_path_install='/usr/bin/install -c' ac_cv_prog_AWK=awk ac_cv_prog_ac_ct_CC=gcc ac_cv_prog_make_make_set=yes ## ----------------- ## ## Output variables. ## ## ----------------- ## ACLOCAL='${SHELL} /tmp/libevent-1.4.12-stable/missing --run aclocal-1.10' AMDEPBACKSLASH='' AMDEP_FALSE='' AMDEP_TRUE='' AMTAR='${SHELL} /tmp/libevent-1.4.12-stable/missing --run tar' AR='' AUTOCONF='${SHELL} /tmp/libevent-1.4.12-stable/missing --run autoconf' AUTOHEADER='${SHELL} /tmp/libevent-1.4.12-stable/missing --run autoheader' AUTOMAKE='${SHELL} /tmp/libevent-1.4.12-stable/missing --run automake-1.10' AWK='awk' BUILD_WIN32_FALSE='' BUILD_WIN32_TRUE='' CC='gcc' CCDEPMODE='' CFLAGS='' CPP='' CPPFLAGS='' CXX='' CXXCPP='' CXXDEPMODE='' CXXFLAGS='' CYGPATH_W='echo' DEFS='' DEPDIR='' DSYMUTIL='' ECHO='/bin/echo' ECHO_C='\c' ECHO_N='' ECHO_T='' EGREP='' EXEEXT='' F77='' FFLAGS='' GREP='' INSTALL_DATA='${INSTALL} -m 644' INSTALL_PROGRAM='${INSTALL}' INSTALL_SCRIPT='${INSTALL}' INSTALL_STRIP_PROGRAM='$(install_sh) -c -s' LDFLAGS='' LIBOBJS='' LIBS='' LIBTOOL='' LIBTOOL_DEPS='' LN_S='' LTLIBOBJS='' MAKEINFO='${SHELL} /tmp/libevent-1.4.12-stable/missing --run makeinfo' MKDIR_P='./install-sh -c -d' NMEDIT='' OBJEXT='' PACKAGE='libevent' PACKAGE_BUGREPORT='' PACKAGE_NAME='' PACKAGE_STRING='' PACKAGE_TARNAME='' PACKAGE_VERSION='' PATH_SEPARATOR=':' RANLIB='' SED='' SET_MAKE='' SHELL='/bin/sh' STRIP='' VERSION='1.4.12-stable' ac_ct_CC='gcc' ac_ct_CXX='' ac_ct_F77='' am__fastdepCC_FALSE='' am__fastdepCC_TRUE='' am__fastdepCXX_FALSE='' am__fastdepCXX_TRUE='' am__include='' am__isrc='' am__leading_dot='.' am__quote='' am__tar='${AMTAR} chof - "$$tardir"' am__untar='${AMTAR} xf -' bindir='${exec_prefix}/bin' build='' build_alias='' build_cpu='' build_os='' build_vendor='' datadir='${datarootdir}' datarootdir='${prefix}/share' docdir='${datarootdir}/doc/${PACKAGE}' dvidir='${docdir}' exec_prefix='NONE' host='' host_alias='' host_cpu='' host_os='' host_vendor='' htmldir='${docdir}' includedir='${prefix}/include' infodir='${datarootdir}/info' install_sh='$(SHELL) /tmp/libevent-1.4.12-stable/install-sh' libdir='${exec_prefix}/lib' libexecdir='${exec_prefix}/libexec' localedir='${datarootdir}/locale' localstatedir='${prefix}/var' mandir='${datarootdir}/man' mkdir_p='$(top_builddir)/./install-sh -c -d' oldincludedir='/usr/include' pdfdir='${docdir}' prefix='/usr/local' program_transform_name='s,x,x,' psdir='${docdir}' sbindir='${exec_prefix}/sbin' sharedstatedir='${prefix}/com' sysconfdir='${prefix}/etc' target_alias='' ## ----------- ## ## confdefs.h. ## ## ----------- ## #define PACKAGE_NAME "" #define PACKAGE_TARNAME "" #define PACKAGE_VERSION "" #define PACKAGE_STRING "" #define PACKAGE_BUGREPORT "" #define PACKAGE "libevent" #define VERSION "1.4.12-stable" configure: exit 77 

वेब के समाधान से एकत्रित समाधान "कॉन्फ़िगर करें: त्रुटि: सी कंपाइलर निष्पादनयोग्य नहीं बना सकता"

आपके पास डेवलपर टूल का एक पुराना सेट है जीसीसी इसकी संस्करण 4.0.1 के रूप में रिपोर्ट कर रहा है। यह ओएस के पुराने संस्करण से माइग्रेट करने से बचा सकता है यदि आपने Xcode 4.3.x को स्थापित किया है, तो आपको उसे लॉन्च करने की आवश्यकता है, उसकी वरीयताओं में जाना, डाउनलोड टैब का चयन करें, और कमांड लाइन टूल पैकेज के बगल में "इंस्टॉल करें" पर क्लिक करें।

मेरे पास कमांड लाइन टूल्स के साथ 10.8 इंस्टॉल और Xcode 4.4 है, और फिर भी मुझे यह त्रुटि मिल रही है। Xcode को पुनर्स्थापित करने के बजाय, मैंने देखा कि मेरे config.log में दो प्रासंगिक पंक्तियां थीं:

 configure:5130: checking for C compiler version configure:5139: /Applications/Xcode.app/Contents/Developer/Toolchains/OSX10.8.xctoolchain/usr/bin/cc --version >&5 

वह रास्ता मेरे लिए मौजूद नहीं था इसके बजाय मैंने:

 /Applications/Xcode.app/Contents/Developer/Toolchains/XcodeDefault.xctoolchain 

सी कंपाइलर ("सीसी") उस एक्सटकॉल्चैन निर्देशिका के अंदर स्थित है। मैंने OSX10.8.xctoolchain के लिए एक सिमलिंक XcodeDefault.xctoolchain को इंगित करने के लिए बनाया है और यह तय किया है। अब मेमकॅचड अधिष्ठापन स्क्रिप्ट कंपाइलर संस्करण को ढूंढ सकता है और अपने रास्ते पर जारी रख सकता है।

 cd /Applications/Xcode.app/Contents/Developer/Toolchains sudo ln -s XcodeDefault.xctoolchain OSX10.8.xctoolchain 

जैसा कि टिप्पणियों में सुझाव दिया गया है, यदि आपको यसोमाइट (10.10) या मावरिक्स (10.9) पर इस समस्या हो रही है, तो आप उस विशिष्ट संस्करण ( OSX10.9.xctoolchain या OSX10.10.xctoolchain ) को इंगित करने के लिए ऊपर सिमलिंक कमांड अपडेट कर सकते हैं।

जब आप यह त्रुटि संदेश देखते हैं, तो आप अपग्रेड के बाद अभी तक Xcode लाइसेंस अनुबंध स्वीकार नहीं कर सकते हैं।

सबसे पहले, सुनिश्चित करें कि आपने अपने कमांडलाइन टूल को अपग्रेड कर लिया है:

 $ xcode-select --install 

अब ऐप्पल चाहता है कि आप इन उपकरणों का उपयोग करने से पहले अपने लाइसेंस से सहमत हो जाएं:

 $ gcc Agreeing to the Xcode/iOS license requires admin privileges, please re-run as root via sudo. $ sudo gcc You have not agreed to the Xcode license agreements. You must agree to both license agreements below in order to use Xcode. [...] 

आपके द्वारा इसे स्वीकार करने के बाद, कमांडलाइन उपकरण अपेक्षित रूप से काम करेंगे

मैंने एक्सकोड में पहले से ही कमांड लाइन टूल्स स्थापित की थीं, परन्तु मैं अभी भी इस पर बेकार था:

 line 3619: /usr/bin/gcc-4.2: No such file or directory 

जब मैंने प्रवेश किया which gcc वापस आया

 /usr/bin/gcc 

जब मैंने gcc -v प्रवेश किया तो मुझे सामान का एक गुच्छा मिल गया

 .. gcc version 4.2.1 (Based on Apple Inc. build 5658) (LLVM build 2336.11.00) 

इसलिए मैंने एक सिमलिंक बनाया है:

 cd /usr/bin sudo ln -s gcc gcc-4.2 

और यह काम किया!

(config.log फ़ाइल निर्देशिका में स्थित होती है जो कि कुछ को बनाने की कोशिश कर रही है)

मुझे इस समस्या का निर्माण एपाचे था। मैंने जो हल इस्तेमाल किया था वह मोस्ताफा के समान था, मुझे दो चर निर्यात करना पड़ा:

 export CC=/Applications/Xcode.app/Contents/Developer/Toolchains/XcodeDefault.xctoolchain/usr/bin/cc CPP='/Applications/Xcode.app/Contents/Developer/Toolchains/XcodeDefault.xctoolchain/usr/bin/cc -E' 

यह मैक ओएसएक्स मेवेरिक्स था

मेरे लिए यह जीसीसी के साथ एक समस्या थी, gcc -v द्वारा हाइलाइट किया गया था। यह हाल ही में एक्सकोड अपग्रेड करने के लिए नीचे था, इस पोस्ट ने sudo xcode-select -switch /Applications/Xcode.app करने के लिए कहा था जो इस मुद्दे को तय करता था।

कम्पाइलर कॉन्फ़िगर के रूप में 'झगड़ा' को सेट करना मेरे लिए काम करना चाहिए:

 export CC=clang pip install --no-clean pycrypto 

अगर कोई यहां आ रहा है क्योंकि आरवीएम / रुबी मुद्दों को पैदा कर रहा है (मिडलमन / ग्रन्ट) मैंने अपनी समस्या का समाधान किया है

पुनश्च। स्टीरोस्कोट द्वारा जवाब कुछ समय पहले मेरी समस्या तय कर लिया … इस समय के आसपास इस मामले को नहीं।

मेरे मामले में आरवीएम, डाउनलोड किए गए जीसीसी को होमब्रे के माध्यम से उपयोग करने का प्रयास कर रहा है। मैं जीसीसी की स्थापना रद्द कर रहा था (मेरे लिए जीसीसी 46) और रूबी स्थापना (पुरानी परियोजना पुरानी रूबी वी) के लिए कोड को पुन:

 $ brew uninstall gcc46 $ rvm install 1.9.3 

आवश्यकताओं के लिए जाँच करने की उस प्रक्रिया के दौरान यह स्वतन्त्र रूप से मेरे लिए एक नया जीसीसी प्राप्त कर लेता है, और अब सभी काम कर रहे हैं। ओह एक बड़ा ध्यान दें, जीसीसी आरवीएम कमांड से स्थापित 10-15 मिनट तक बिना किसी पाठ को फेंक ले सकता है, यह जमे हुए नहीं है 🙂 शुभकामनाएँ

मैं इस पृष्ठ को पूरी तरह से पढ़ता हूं, जिसके लिए समाधान ढूंढने की उम्मीद है:

 "configure: error: C compiler cannot create executables" 

अंत में कुछ भी काम नहीं किया, क्योंकि मेरी समस्या एक "टाइपिंग" थी, और सीएफएलएजी से संबंधित थी। मेरी .bash_profile फ़ाइल में मेरे पास था:

 export ARM_ARCH="arm64” export CFLAGS="-arch ${ARM_ARCH}" 

जैसा कि आप देख सकते हैं — निर्यात ARM_ARCH = "arm64" — पिछले उद्धरण चिह्न पहले उद्धरण चिह्न के साथ समान नहीं है। पहले एक (") कानूनी है, जबकि दूसरे (") नहीं है।
यह क्योंकि मैंने गलती की है TextEdit (मैं MacOS के तहत काम कर रहा हूँ) का उपयोग करने के लिए किया, और यह स्पष्ट रूप से एक स्मार्टकोट्स नामक एक सुविधा है: उद्धरण चिह्नों के बदले में गैरकानूनी शैली के लिए जब भी आप इसके आगे ही कुछ संपादित करते हैं।
सबक सीखा: एक उचित पाठ संपादक का उपयोग करें …

मेरे मामले में, मैंने xcode-select --install की कोशिश की xcode-select --install लेकिन यह कहता है कि यह स्टोर से उपलब्ध नहीं है। फिर, रीमियन से प्रेरित, मैंने अपने जीसीसी: gcc -v और फिर मुझे एक संदेश मिला, जिसमें कहा गया है कि मैंने राज़ी नहीं किया।

उस बिंदु से मैं सिर्फ gcc -v से समझौते की प्रक्रिया का पालन करता हूं, क्योंकि मैं gcc -v हूं कि यह मेरे लिए ठीक काम करता है

सुनिश्चित करें कि आपके Xcode एप्लिकेशन नाम में कोई रिक्त स्थान नहीं है (यदि आप पुराने संस्करणों के आसपास रहते हैं तो हो सकता है – उदाहरण के लिए इसे 'Xcode 4.app' का नाम बदला); निर्माण उपकरण Xcode बंडल पथ के भीतर संदर्भित किया जाएगा, और कई स्क्रिप्ट रिक्त स्थान के साथ संदर्भ ठीक से संभाल नहीं सकते।

आईओएस क्रॉस-कंपाइलर को झुकाव के बारे में

मैंने पाया है कि समस्या miphoneos-version-min=5.0 मैं miphoneos-version-min=8.0 में बदल दिया है अब यह काम कर रहा है।

मैं सिर्फ एक साधारण test.c फ़ाइल बनाने का उपयोग करने का सुझाव चाहता हूं और इसे लॉग में लिखने के आदेश से संकलित कर रहा हूं।